IAP GITLAB

curved

18 jobs for !316 with curved_tracking in 15 minutes and 35 seconds (queued for 27 minutes and 29 seconds)
detached
Status Job ID Name Coverage
  Quality
passed #39944
corsika
check-clang-format

00:01:11

passed #39940
corsika
check-copyrights

00:00:12

 
  Config
passed #39947
corsika
config-clang-8

00:03:29

passed #39945
corsika
config-u-18_04

00:01:57

 
  Build
manual #39949
corsika allowed to fail manual
build-clang-8
manual #39948
corsika allowed to fail manual
build-u-18_04
 
  Test
manual #39951
corsika allowed to fail manual
test-clang-8
manual #39950
corsika allowed to fail manual
test-u-18_04
 
  Build Test
failed #39953
corsika
build_test-clang-8

00:04:28

failed #39952
corsika
build_test-u-18_04

00:04:15

 
  Build Test Example
skipped #39955
corsika allowed to fail manual
build_test_example-clang-8
skipped #39954
corsika allowed to fail manual
build_test_example-u-18_04
 
  Install
skipped #39957
corsika allowed to fail manual
install-clang-8
skipped #39956
corsika allowed to fail manual
install-u-18_04
 
  Optional
skipped #39960
corsika allowed to fail manual
coverage
skipped #39959
corsika allowed to fail manual
release-full-clang-8
skipped #39958
corsika allowed to fail manual
release-full-u-18_04
skipped #39961
corsika allowed to fail manual
sanity
 
Name Stage Failure
failed
build_test-clang-8 Build Test
CMakeFiles/Makefile2:1050: recipe for target 'tests/framework/CMakeFiles/testFramework.dir/all' failed
make[1]: *** [tests/framework/CMakeFiles/testFramework.dir/all] Error 2
make: *** [all] Error 2
Makefile:140: recipe for target 'all' failed
Uploading artifacts for failed job
Uploading artifacts...
WARNING: /builds/0/corsika/build/test_outputs/junit*.xml: no matching files
ERROR: No files to upload
ERROR: Job failed: exit code 1
failed
build_test-u-18_04 Build Test
CMakeFiles/Makefile2:1050: recipe for target 'tests/framework/CMakeFiles/testFramework.dir/all' failed
make[1]: *** [tests/framework/CMakeFiles/testFramework.dir/all] Error 2
Makefile:140: recipe for target 'all' failed
make: *** [all] Error 2
Uploading artifacts for failed job
Uploading artifacts...
WARNING: /builds/0/corsika/build/test_outputs/junit*.xml: no matching files
ERROR: No files to upload
ERROR: Job failed: exit code 1