IAP GITLAB

fixed-stepsize integration with boost::numeric::odeint

18 jobs for !322 with 391-new-design-of-continuous-processes in 19 minutes and 50 seconds (queued for 7 minutes and 30 seconds)
latest detached
Status Job ID Name Coverage
  Quality
failed #48134
corsika allowed to fail
check-clang-format

00:00:32

failed #48133
corsika allowed to fail
check-copyrights

00:00:25

 
  Config
passed #48138
corsika
config-clang-8

00:05:35

passed #48137
corsika
config-u-18_04

00:01:27

 
  Build
manual #48140
corsika allowed to fail manual
build-clang-8
manual #48139
corsika allowed to fail manual
build-u-18_04
 
  Test
manual #48142
corsika allowed to fail manual
test-clang-8
manual #48141
corsika allowed to fail manual
test-u-18_04
 
  Build Test
failed #48144
corsika
build_test-clang-8

00:07:21

failed #48143
corsika
build_test-u-18_04

00:04:27

 
  Build Test Example
skipped #48146
corsika allowed to fail manual
build_test_example-clang-8
skipped #48145
corsika allowed to fail manual
build_test_example-u-18_04
 
  Install
skipped #48148
corsika allowed to fail manual
install-clang-8
skipped #48147
corsika allowed to fail manual
install-u-18_04
 
  Optional
skipped #48151
corsika allowed to fail manual
coverage
skipped #48150
corsika allowed to fail manual
release-full-clang-8
skipped #48149
corsika allowed to fail manual
release-full-u-18_04
skipped #48152
corsika allowed to fail manual
sanity
 
Name Stage Failure
failed
build_test-clang-8 Build Test
CMakeFiles/Makefile2:1062: recipe for target 'tests/modules/CMakeFiles/testModules.dir/all' failed
Makefile:159: recipe for target 'all' failed
make: *** [all] Error 2
Uploading artifacts for failed job
Uploading artifacts...
/builds/0/corsika/build/test_outputs/junit*.xml: found 4 matching files and directories

Uploading artifacts as "junit" to coordinator... ok
id=48144 responseStatus=201 Created token=11MuXjhM
Cleaning up file based variables
ERROR: Job failed: exit code 1
failed
build_test-u-18_04 Build Test
make[1]: *** [tests/modules/CMakeFiles/testModules.dir/all] Error 2
Makefile:159: recipe for target 'all' failed
make: *** [all] Error 2
Uploading artifacts for failed job
Uploading artifacts...
/builds/0/corsika/build/test_outputs/junit*.xml: found 4 matching files and directories

Uploading artifacts as "junit" to coordinator... ok
id=48143 responseStatus=201 Created token=W1cksuez
Cleaning up file based variables
ERROR: Job failed: exit code 1
failed
check-clang-format Quality
Executing "step_script" stage of the job script
Using docker image sha256:b8ea97f098c511e6a85b43d403e05ada361bbf99796573588220c07130bb46bb for corsika/devel:clang-8 with digest corsika/devel@sha256:8aa4d5ede6b3f669975c42a5779185a22058d3326a193ef62bdb4543db36e4da ...
$ ./do-clang-format.py --all
clang-format version 8.0.0-3~ubuntu18.04.2 (tags/RELEASE_800/final)

Note: the clang-format version has an impact on the result. Make sure you are consistent with current CI. Consider '--docker' option.
./corsika/detail/framework/core/Cascade.inl
Cleaning up file based variables
ERROR: Job failed: exit code 1
failed
check-copyrights Quality
Entering 'modules/data'
Entering 'modules/proposal'
Executing "step_script" stage of the job script
Using docker image sha256:e29eacf4d34722f0d1b16745de4f8d555548857055af538a28d811771b85775e for corsika/devel:u-18.04 with digest corsika/devel@sha256:9de8b2c3653a51fd186ce12870eba738cc868a93eccaf5c4f5f184d4ffa91893 ...
$ ./do-copyright.py
Only checking. No changes. See 'do-copyright.py -h' for options.
No copyright note in file: ./corsika/stack/ContinuousParticleState.hpp
Cleaning up file based variables
ERROR: Job failed: exit code 1